Target
Histone acetyltransferase p300
Ligand
BDBM50081172
Substrate
Meas. Tech.
ChEMBL_1475665 (CHEMBL3424794)
Kd
110±n/a nM
Citation
 Milite, CFeoli, ASasaki, KLa Pietra, VBalzano, ALMarinelli, LMai, ANovellino, ECastellano, STosco, ASbardella, G A novel cell-permeable, selective, and noncompetitive inhibitor of KAT3 histone acetyltransferases from a combined molecular pruning/classical isosterism approach. J Med Chem 58:2779-98 (2015)  
Target
Name:
Histone acetyltransferase p300
Synonyms:
EP300 HIF1A/p300/CREB-binding protein P300
Type:
Protein
Mol. Mass.:
264223.04
Organism:
Homo sapiens (Human)
Description:
Q09472
Residue:
2414
  
Inhibitor
Name:
BDBM50081172
Synonyms:
CHEMBL3421930
Type:
Small organic molecule
Emp. Form.:
C25H22N2O3
Mol. Mass.:
398.4538
SMILES:
O=C1C(Cc2ccccc2)C(=O)N(Cc2ccccc2)C(=O)N1Cc1ccccc1
: