Target
Neuromedin-K receptor
Ligand
BDBM50081274
Substrate
Meas. Tech.
ChEMBL_1475765 (CHEMBL3424998)
IC50
398±n/a nM
Citation
 Hoveyda, HRFraser, GLRoy, MODutheuil, GBatt, FEl Bousmaqui, MKorac, JLenoir, FLapin, ANoël, SBlanc, S Discovery and optimization of novel antagonists to the human neurokinin-3 receptor for the treatment of sex-hormone disorders (Part I). J Med Chem 58:3060-82 (2015)  
Target
Name:
Neuromedin-K receptor
Synonyms:
NK-3 receptor NK3R NKR Neurokinin B receptor Neuromedin-3 receptor (NK-3R) Neuromedin-K receptor Neuromedin-K receptor (NK3) TAC3R Tachykinin receptor 3 | Tachykinin receptor 3 (NK3)
Type:
Enzyme
Mol. Mass.:
52221.96
Organism:
Homo sapiens (Human)
Description:
P29371
Residue:
465
  
Inhibitor
Name:
BDBM50081274
Synonyms:
CHEMBL3422004 | US10544150, Compound 39
Type:
Small organic molecule
Emp. Form.:
C18H13F4N5O
Mol. Mass.:
391.3223
SMILES:
Fc1ccc(cc1)C(=O)N1CCn2c(C1)nnc2-c1cccc(n1)C(F)(F)F
: