Target
Cytochrome P450 3A4
Ligand
BDBM50081274
Substrate
Meas. Tech.
ChEMBL_1475768 (CHEMBL3425001)
IC50
>100000±n/a nM
Citation
 Hoveyda, HRFraser, GLRoy, MODutheuil, GBatt, FEl Bousmaqui, MKorac, JLenoir, FLapin, ANoël, SBlanc, S Discovery and optimization of novel antagonists to the human neurokinin-3 receptor for the treatment of sex-hormone disorders (Part I). J Med Chem 58:3060-82 (2015)  
Target
Name:
Cytochrome P450 3A4
Synonyms:
Albendazole monooxygenase CP3A4_HUMAN CYP3A4 CYPIIIA4 Cytochrome P450 3A4 (CYP3A4) Nifedipine oxidase Taurochenodeoxycholate 6-alpha-hydroxylase
Type:
Enzyme
Mol. Mass.:
57349.57
Organism:
Homo sapiens (Human)
Description:
Residue:
503
  
Inhibitor
Name:
BDBM50081274
Synonyms:
CHEMBL3422004 | US10544150, Compound 39
Type:
Small organic molecule
Emp. Form.:
C18H13F4N5O
Mol. Mass.:
391.3223
SMILES:
Fc1ccc(cc1)C(=O)N1CCn2c(C1)nnc2-c1cccc(n1)C(F)(F)F
: