Target
Cytochrome P450 1A2
Ligand
BDBM50081274
Substrate
Meas. Tech.
ChEMBL_1475772 (CHEMBL3425005)
IC50
21000±n/a nM
Citation
 Hoveyda, HRFraser, GLRoy, MODutheuil, GBatt, FEl Bousmaqui, MKorac, JLenoir, FLapin, ANoël, SBlanc, S Discovery and optimization of novel antagonists to the human neurokinin-3 receptor for the treatment of sex-hormone disorders (Part I). J Med Chem 58:3060-82 (2015)  
Target
Name:
Cytochrome P450 1A2
Synonyms:
CP1A2_HUMAN CYPIA2 Cytochrome P(3)450 Cytochrome P450 1A2 (CYP1A2) Cytochrome P450-P3
Type:
Enzyme
Mol. Mass.:
58423.38
Organism:
Homo sapiens (Human)
Description:
P05177
Residue:
516
  
Inhibitor
Name:
BDBM50081274
Synonyms:
CHEMBL3422004 | US10544150, Compound 39
Type:
Small organic molecule
Emp. Form.:
C18H13F4N5O
Mol. Mass.:
391.3223
SMILES:
Fc1ccc(cc1)C(=O)N1CCn2c(C1)nnc2-c1cccc(n1)C(F)(F)F
: