Target
Glycine receptor subunit alpha-1
Ligand
BDBM50363397
Substrate
Meas. Tech.
ChEMBL_1474520 (CHEMBL3423809)
EC50
1800±n/a nM
Citation
 Wells, MMTillman, TSMowrey, DDSun, TXu, YTang, P Ensemble-based virtual screening for cannabinoid-like potentiators of the human glycine receptora1 for the treatment of pain. J Med Chem 58:2958-66 (2015)  
Target
Name:
Glycine receptor subunit alpha-1
Synonyms:
GLRA1 Glycine receptor 48 kDa subunit | Glycine receptor strychnine-binding subunit
Type:
Enzyme Catalytic Domain
Mol. Mass.:
52635.39
Organism:
Homo sapiens (Human)
Description:
P23415
Residue:
457
  
Inhibitor
Name:
BDBM50363397
Synonyms:
CHEMBL1946170 US10183928, Regorafenib US10227329, Compound Regorafenib US10584114, Compound Regorafenib US11279688, Compound Regorafenib
Type:
Small organic molecule
Emp. Form.:
C21H15ClF4N4O3
Mol. Mass.:
482.815
SMILES:
CNC(=O)c1cc(Oc2ccc(NC(=O)Nc3ccc(Cl)c(c3)C(F)(F)F)c(F)c2)ccn1
: