Target
Farnesyl pyrophosphate synthase
Ligand
BDBM50083067
Substrate
Meas. Tech.
ChEMBL_1474098 (CHEMBL3424031)
IC50
>2000000±n/a nM
Citation
 Zhou, XBorn, EJAllen, CHolstein, SAWiemer, DF N-Oxide derivatives of 3-(3-pyridyl)-2-phosphonopropanoic acids as potential inhibitors of Rab geranylgeranylation. Bioorg Med Chem Lett 25:2331-4 (2015)  
Target
Name:
Farnesyl pyrophosphate synthase
Synonyms:
Dimethylallyltranstransferase FPP synthase FPPS_HUMAN Farnesyl diphosphate synthase Farnesyl diphosphate synthetase Farnesyl pyrophosphate synthetase KIAA1293 | P14324
Type:
Enzyme
Mol. Mass.:
48272.89
Organism:
Homo sapiens (Human)
Description:
P14324
Residue:
419
  
Inhibitor
Name:
BDBM50083067
Synonyms:
CHEMBL3422846
Type:
Small organic molecule
Emp. Form.:
C8H10NO6P
Mol. Mass.:
247.1419
SMILES:
OC(=O)C(Cc1ccc[n+]([O-])c1)P(O)(O)=O
: