Target
Prostaglandin G/H synthase 2
Ligand
BDBM50084272
Substrate
Meas. Tech.
ChEMBL_1477171 (CHEMBL3428611)
IC50
1300±n/a nM
Citation
 Yan, YMLi, LJQin, XCLu, QTu, ZCCheng, YX Compounds from the insect Blaps japanensis with COX-1 and COX-2 inhibitory activities. Bioorg Med Chem Lett 25:2469-72 (2015)  
Target
Name:
Prostaglandin G/H synthase 2
Synonyms:
COX2 Cyclooxygenase 2 (COX-2) Cyclooxygenase-2 (COX-2 AA) Cyclooxygenase-2 (COX-2) PGH2_HUMAN PHS II Prostaglandin E synthase/G/H synthase 2 Prostaglandin-endoperoxide synthase 2
Type:
Enzyme
Mol. Mass.:
69003.89
Organism:
Homo sapiens (Human)
Description:
Recombinant Cox-2 provided by Cayman (Cayman Chemical Co.,Ann Arbor, MI).
Residue:
604
  
Inhibitor
Name:
BDBM50084272
Synonyms:
CHEMBL3425988
Type:
Small organic molecule
Emp. Form.:
C18H19NO6
Mol. Mass.:
345.3466
SMILES:
CC(=O)N[C@H]1Oc2cc(CCO)ccc2O[C@@H]1c1ccc(O)c(O)c1
: