Target
Catechol O-methyltransferase
Ligand
BDBM50086215
Substrate
Meas. Tech.
ChEMBL_1477938 (CHEMBL3429505)
IC50
>5000±n/a nM
Citation
 Harrison, STPoslusney, MSMulhearn, JJZhao, ZKett, NRSchubert, JWMelamed, JYAllison, TJPatel, SBSanders, JMSharma, SSmith, RFHall, DLRobinson, RGSachs, NAHutson, PHWolkenberg, SEBarrow, JC Synthesis and Evaluation of Heterocyclic Catechol Mimics as Inhibitors of Catechol-O-methyltransferase (COMT). ACS Med Chem Lett 6:318-23 (2015)  
Target
Name:
Catechol O-methyltransferase
Synonyms:
COMT Catechol O-methyltransferase | Catechol O-methyltransferase (MB-COMT)
Type:
Enzyme
Mol. Mass.:
30030.67
Organism:
Homo sapiens (Human)
Description:
P21964
Residue:
271
  
Inhibitor
Name:
BDBM50086215
Synonyms:
CHEMBL3425743 | US9260413, Example 3
Type:
Small organic molecule
Emp. Form.:
C17H14N2O2
Mol. Mass.:
278.3053
SMILES:
Cn1c(ncc(O)c1=O)-c1cccc(c1)-c1ccccc1
: