Target
Endoplasmin
Ligand
BDBM50087524
Substrate
Meas. Tech.
ChEMBL_1478163 (CHEMBL3427924)
IC50
390±n/a nM
Citation
 Patel, HJPatel, PDOchiana, SOYan, PSun, WPatel, MRShah, SKTramentozzi, EBrooks, JBolaender, AShrestha, LStephani, RFinotti, PLeifer, CLi, ZGewirth, DTTaldone, TChiosis, G Structure-activity relationship in a purine-scaffold compound series with selectivity for the endoplasmic reticulum Hsp90 paralog Grp94. J Med Chem 58:3922-43 (2015)  
Target
Name:
Endoplasmin
Synonyms:
94 kDa glucose-regulated protein GRP-94 Glucose regulated protein 94kDa (Grp94) Heat shock protein 90 kDa beta member 1 Tumor rejection antigen 1 | gp96 homolog
Type:
Protein
Mol. Mass.:
92417.36
Organism:
Homo sapiens (Human)
Description:
P14625
Residue:
803
  
Inhibitor
Name:
BDBM50087524
Synonyms:
CHEMBL3426756
Type:
Small organic molecule
Emp. Form.:
C15H11Cl2N5S
Mol. Mass.:
364.252
SMILES:
Nc1ncnc2n(CCC#C)c(Sc3ccc(Cl)cc3Cl)nc12
: