Target
Receptor-type tyrosine-protein phosphatase R
Ligand
BDBM82577
Substrate
Meas. Tech.
ChEMBL_1476400 (CHEMBL3430030)
IC50
13000±n/a nM
Citation
 Tautz, LSenis, YAOury, CRahmouni, S Perspective: Tyrosine phosphatases as novel targets for antiplatelet therapy. Bioorg Med Chem 23:2786-97 (2015)  
Target
Name:
Receptor-type tyrosine-protein phosphatase R
Synonyms:
Ch-1PTPase ECPTP PTPRQ PTPRR_HUMAN R-PTP-R | Receptor-type tyrosine-protein phosphatase R
Type:
PROTEIN
Mol. Mass.:
73850.59
Organism:
Homo sapiens (Human)
Description:
ChEMBL_109611
Residue:
657
  
Inhibitor
Name:
BDBM82577
Synonyms:
(4-fluoro-1,3-benzothiazol-2-yl)-[5-(4-methoxyphenyl)-1,3,4-oxadiazol-2-yl]amine N-(4-fluoranyl-1,3-benzothiazol-2-yl)-5-(4-methoxyphenyl)-1,3,4-oxadiazol-2-amine cid_7158830
Type:
Small organic molecule
Emp. Form.:
C16H11FN4O2S
Mol. Mass.:
342.348
SMILES:
COc1ccc(cc1)-c1nnc(Nc2nc3c(F)cccc3s2)o1
: