Target
Tyrosine-protein phosphatase non-receptor type 11
Ligand
BDBM50087880
Substrate
Meas. Tech.
ChEMBL_1476397 (CHEMBL3430027)
IC50
2900±n/a nM
Citation
 Tautz, LSenis, YAOury, CRahmouni, S Perspective: Tyrosine phosphatases as novel targets for antiplatelet therapy. Bioorg Med Chem 23:2786-97 (2015)  
Target
Name:
Tyrosine-protein phosphatase non-receptor type 11
Synonyms:
3.1.3.48 PTP-1D PTP2C Protein Tyrosine Phosphatase PPN11/Shp2 Protein-Tyrosine Phosphatase SHP-2 Protein-tyrosine phosphatase 2C SH-PTP3 SHP2 Src homology phosphatase 2 (SHP-2) Tyrosine-protein phosphatase non-receptor type 11 (SHP-2) | Tyrosine-protein phosphatase non-receptor type 11 (SHP2)
Type:
Protein phosphatase
Mol. Mass.:
68443.59
Organism:
Homo sapiens (Human)
Description:
Q06124
Residue:
593
  
Inhibitor
Name:
BDBM50087880
Synonyms:
TAUTOMYCETIN
Type:
Small organic molecule
Emp. Form.:
C34H52O9
Mol. Mass.:
604.7713
SMILES:
CC\C(C=C)=C/C(=O)C[C@H](C)C[C@@H](C)CC[C@H](O)[C@H](C)C(=O)C[C@@H](O)[C@H](C)[C@@H](C)OC(=O)C[C@@H](C)C1=C(C)C(=O)OC1=O
: