Target
Tyrosine-protein phosphatase non-receptor type 1
Ligand
BDBM50087883
Substrate
Meas. Tech.
ChEMBL_1476394 (CHEMBL3430024)
Ki
26±n/a nM
Citation
 Tautz, LSenis, YAOury, CRahmouni, S Perspective: Tyrosine phosphatases as novel targets for antiplatelet therapy. Bioorg Med Chem 23:2786-97 (2015)  
Target
Name:
Tyrosine-protein phosphatase non-receptor type 1
Synonyms:
PTN1_HUMAN PTPN1 Protein tyrosine phosphatase-1B (PTP1B) Protein-tyrosine phosphatase 1B (PTP1B) Tyrosine-protein phosphatase non-receptor type 1 (PTP1B)
Type:
Protein phosphatase
Mol. Mass.:
49963.76
Organism:
Homo sapiens (Human)
Description:
Human recombinant GST-fusion PTP1B (1-435).
Residue:
435
  
Inhibitor
Name:
BDBM50087883
Synonyms:
CHEMBL3426930
Type:
Small organic molecule
Emp. Form.:
C39H56F4N4O12P2
Mol. Mass.:
910.8227
SMILES:
CCCCCCCCCCCCCCC(=O)N[C@@H](Cc1ccc(cc1)C(F)(F)P(O)(O)=O)C(=O)N[C@@H](CC(O)=O)C(=O)N[C@@H](Cc1ccc(cc1)C(F)(F)P(O)(O)=O)C(N)=O
: