Target
Tyrosine-protein phosphatase non-receptor type 1
Ligand
BDBM50341994
Substrate
Meas. Tech.
ChEMBL_1476393 (CHEMBL3430023)
Ki
220±n/a nM
Citation
 Tautz, LSenis, YAOury, CRahmouni, S Perspective: Tyrosine phosphatases as novel targets for antiplatelet therapy. Bioorg Med Chem 23:2786-97 (2015)  
Target
Name:
Tyrosine-protein phosphatase non-receptor type 1
Synonyms:
PTN1_HUMAN PTPN1 Protein tyrosine phosphatase-1B (PTP1B) Protein-tyrosine phosphatase 1B (PTP1B) Tyrosine-protein phosphatase non-receptor type 1 (PTP1B)
Type:
Protein phosphatase
Mol. Mass.:
49963.76
Organism:
Homo sapiens (Human)
Description:
Human recombinant GST-fusion PTP1B (1-435).
Residue:
435
  
Inhibitor
Name:
BDBM50341994
Synonyms:
2-(((5-tert-butylthiazol-2-yl)methyl)((4-(4-((4-(heptan-4-yl)phenoxy)methyl)phenyl)thiazol-2-yl)methyl)amino)acetic acid | CHEMBL1765350
Type:
Small organic molecule
Emp. Form.:
C34H43N3O3S2
Mol. Mass.:
605.854
SMILES:
CCCC(CCC)c1ccc(OCc2ccc(cc2)-c2csc(CN(CC(O)=O)Cc3ncc(s3)C(C)(C)C)n2)cc1
: