Target
Tyrosine-protein phosphatase non-receptor type 1
Ligand
BDBM50209683
Substrate
Meas. Tech.
ChEMBL_1476391 (CHEMBL3430021)
IC50
384±n/a nM
Citation
 Tautz, LSenis, YAOury, CRahmouni, S Perspective: Tyrosine phosphatases as novel targets for antiplatelet therapy. Bioorg Med Chem 23:2786-97 (2015)  
Target
Name:
Tyrosine-protein phosphatase non-receptor type 1
Synonyms:
PTN1_HUMAN PTPN1 Protein tyrosine phosphatase-1B (PTP1B) Protein-tyrosine phosphatase 1B (PTP1B) Tyrosine-protein phosphatase non-receptor type 1 (PTP1B)
Type:
Protein phosphatase
Mol. Mass.:
49963.76
Organism:
Homo sapiens (Human)
Description:
Human recombinant GST-fusion PTP1B (1-435).
Residue:
435
  
Inhibitor
Name:
BDBM50209683
Synonyms:
(R)-2-(4-(9-bromo-2,3-dimethylnaphtho[2,3-b]thiophen-4-yl)-2,6-dimethylphenoxy)-3-phenylpropanoic acid CHEMBL184041 | Ertiprotafib
Type:
Small organic molecule
Emp. Form.:
C31H27BrO3S
Mol. Mass.:
559.513
SMILES:
Cc1sc2c(Br)c3ccccc3c(-c3cc(C)c(O[C@H](Cc4ccccc4)C(O)=O)c(C)c3)c2c1C
: