Target
DNA repair protein RAD51 homolog 1
Ligand
BDBM93044
Substrate
Meas. Tech.
ChEMBL_1476957 (CHEMBL3430212)
Kd
570000±n/a nM
Citation
 Magee, TV Progress in discovery of small-molecule modulators of protein-protein interactions via fragment screening. Bioorg Med Chem Lett 25:2461-8 (2015)  
Target
Name:
DNA repair protein RAD51 homolog 1
Synonyms:
RAD51 RAD51_HUMAN | RECA
Type:
Enzyme Catalytic Domain
Mol. Mass.:
36960.74
Organism:
Homo sapiens (Human)
Description:
gi_49168602
Residue:
339
  
Inhibitor
Name:
BDBM93044
Synonyms:
L-Methyl ester tryptophan, 8
Type:
Emp. Form.:
C12H14N2O2
Mol. Mass.:
218.2518
SMILES:
COC(=O)[C@@H](N)Cc1c[nH]c2ccccc12
: