Target
Sodium channel protein type 5 subunit alpha
Ligand
BDBM84735
Substrate
Meas. Tech.
ChEMBL_1478532 (CHEMBL3430433)
IC50
6310±n/a nM
Citation
 Mirams, GRDavies, MRBrough, SJBridgland-Taylor, MHCui, YGavaghan, DJAbi-Gerges, N Prediction of Thorough QT study results using action potential simulations based on ion channel screens. J Pharmacol Toxicol Methods 70:246-54 (2014)  
Target
Name:
Sodium channel protein type 5 subunit alpha
Synonyms:
HH1 SCN5A_HUMAN Sodium channel protein type 5 subunit alpha/beta-1/beta-2 Voltage-gated sodium channel subunit alpha Nav1.5
Type:
Enzyme
Mol. Mass.:
226908.60
Organism:
Homo sapiens (Human)
Description:
Q14524
Residue:
2016
  
Inhibitor
Name:
BDBM84735
Synonyms:
CAS_99200-09-6 Nebivolol
Type:
Small organic molecule
Emp. Form.:
C22H25F2NO4
Mol. Mass.:
405.435
SMILES:
OC(CNCC(O)C1CCc2cc(F)ccc2O1)C1CCc2cc(F)ccc2O1
: