Target
Voltage-dependent L-type calcium channel subunit alpha-1C
Ligand
BDBM84735
Substrate
Meas. Tech.
ChEMBL_1478502 (CHEMBL3430403)
IC50
15849±n/a nM
Citation
 Mirams, GRDavies, MRBrough, SJBridgland-Taylor, MHCui, YGavaghan, DJAbi-Gerges, N Prediction of Thorough QT study results using action potential simulations based on ion channel screens. J Pharmacol Toxicol Methods 70:246-54 (2014)  
Target
Name:
Voltage-dependent L-type calcium channel subunit alpha-1C
Synonyms:
CAC1C_HUMAN CACN2 CACNL1A1 Calcium channel (Type L) L-type calcium channel alpha-1c/beta-2/alpha2delta-1 Voltage-gated L-type calcium channel Voltage-gated calcium channel | Voltage-gated calcium channel subunit alpha Cav1.2
Type:
Enzyme Catalytic Domain
Mol. Mass.:
248979.79
Organism:
Homo sapiens (Human)
Description:
Calcium channel (Type L) 0 HUMAN::Q13936
Residue:
2221
  
Inhibitor
Name:
BDBM84735
Synonyms:
CAS_99200-09-6 Nebivolol
Type:
Small organic molecule
Emp. Form.:
C22H25F2NO4
Mol. Mass.:
405.435
SMILES:
OC(CNCC(O)C1CCc2cc(F)ccc2O1)C1CCc2cc(F)ccc2O1
: