Target
Cytochrome P450 2C19
Ligand
BDBM50363928
Substrate
Meas. Tech.
ChEMBL_1487041 (CHEMBL3531867)
Ki
>30000±n/a nM
Citation
 Foti, RSPearson, JTWong, SLZalikowski, JABoudreaux, MDProkop, SPDavis, JABanfield, CEmery, MGRock, DAWahlstrom, JLWienkers, LCAmore, BM Predicting the drug interaction potential of AMG 853, a dual antagonist of the D-prostanoid and chemoattractant receptor-homologous molecule expressed on T helper 2 cells receptors. Drug Metab Dispos 40:2239-49 (2012)  
Target
Name:
Cytochrome P450 2C19
Synonyms:
(R)-limonene 6-monooxygenase (S)-limonene 7-monooxygenase CYP2C19 CYPIIC19 Cytochrome P450 2C19 [I331V] Cytochrome P450-254C Mephenytoin 4-hydroxylase P450-254C
Type:
Enzyme
Mol. Mass.:
55935.47
Organism:
Homo sapiens (Human)
Description:
P33261
Residue:
490
  
Inhibitor
Name:
BDBM50363928
Synonyms:
CHEMBL1951575
Type:
Small organic molecule
Emp. Form.:
C28H27Cl2FN2O6S
Mol. Mass.:
609.493
SMILES:
CC(C)(C)NC(=O)c1ccc(Oc2cc(F)c(CC(O)=O)cc2Cl)c(NS(=O)(=O)c2ccc(cc2Cl)C2CC2)c1
: