Target
UDP-glucuronosyltransferase 1A1
Ligand
BDBM23411
Substrate
Meas. Tech.
ChEMBL_1491697 (CHEMBL3536530)
Ki
41300±n/a nM
Citation
 Gao, CZhang, HGuo, ZYou, TChen, XZhong, D Mechanistic studies on the absorption and disposition of scutellarin in humans: selective OATP2B1-mediated hepatic uptake is a likely key determinant for its unique pharmacokinetic characteristics. Drug Metab Dispos 40:2009-20 (2012)  
Target
Name:
UDP-glucuronosyltransferase 1A1
Synonyms:
Bilirubin-specific UDPGT isozyme 1 UD11_HUMAN UDP-glucuronosyltransferase 1-A UDPGT 1-1 UGT1 UGT1-01 UGT1A Uridine-5'-diphosphoglucuronosyltransferase 1A1 | hUG-BR1
Type:
Enzyme
Mol. Mass.:
59604.34
Organism:
Homo sapiens (Human)
Description:
P22309
Residue:
533
  
Inhibitor
Name:
BDBM23411
Synonyms:
5,6,7-trihydroxy-2-(4-hydroxyphenyl)-4H-chromen-4-one Scutellarein Scutellarein (28) | US10252984, Table 2.2
Type:
flavone
Emp. Form.:
C15H10O6
Mol. Mass.:
286.2363
SMILES:
Oc1ccc(cc1)-c1cc(=O)c2c(O)c(O)c(O)cc2o1
: