Target
Microtubule-associated protein 2
Ligand
BDBM50088527
Substrate
Meas. Tech.
ChEMBL_1492831 (CHEMBL3527961)
EC50
0.095000±n/a nM
Citation
 Arico-Muendel, CCBelanger, BBenjamin, DBlanchette, HSCaiazzo, TMCentrella, PADeLorey, JDoyle, EGGradhand, UGriffin, STHill, SLabenski, MTMorgan, BAO'Donovan, GPrasad, KSkinner, STaghizadeh, NThompson, CDWakefield, JWestlin, WWhite, KF Metabolites of PPI-2458, a selective, irreversible inhibitor of methionine aminopeptidase-2: structure determination and in vivo activity. Drug Metab Dispos 41:814-26 (2013)  
Target
Name:
Microtubule-associated protein 2
Synonyms:
MAP-2 MTAP2_HUMAN
Type:
PROTEIN
Mol. Mass.:
199423.64
Organism:
Homo sapiens (Human)
Description:
ChEMBL_107603
Residue:
1827
  
Inhibitor
Name:
BDBM50088527
Synonyms:
CHEMBL3527358
Type:
Small organic molecule
Emp. Form.:
C22H36N2O6
Mol. Mass.:
424.531
SMILES:
[H][C@@]1([#6@H](-[#8]-[#6])-[#6@@H](-[#6]-[#6][C@]11[#6]-[#8]1)-[#8]-[#6](=O)-[#7]-[#6@H](-[#6](-[#6])-[#6])-[#6](-[#7])=O)[C@@]1([#6])[#8]-[#6@@H]1-[#6]\[#6]=[#6](\[#6])-[#6]
: