Target
Mitogen-activated protein kinase 3
Ligand
BDBM50089077
Substrate
Meas. Tech.
ChEMBL_1497089 (CHEMBL3580222)
IC50
21±n/a nM
Citation
 Awadallah, FMAbou-Seri, SMAbdulla, MMGeorgey, HH Design and synthesis of potent 1,2,4-trisubstituted imidazolinone derivatives with dual p38aMAPK and ERK1/2 inhibitory activity. Eur J Med Chem 94:397-404 (2015)  
Target
Name:
Mitogen-activated protein kinase 3
Synonyms:
ERK1 Extracellular signal-regulated kinase 1 MAP kinase ERK1 MAPK3/MAPK7 Mitogen-activated protein kinase PRKM3
Type:
Protein
Mol. Mass.:
43136.58
Organism:
Homo sapiens (Human)
Description:
curated by PDB 4QTB
Residue:
379
  
Inhibitor
Name:
BDBM50089077
Synonyms:
CHEMBL3577641
Type:
Small organic molecule
Emp. Form.:
C32H27N3O5
Mol. Mass.:
533.5739
SMILES:
COc1ccc(cc1)N1C(=O)\C(=C\c2ccc(OCC(=O)Nc3cccc(OC)c3)cc2)N=C1c1ccccc1
: