Target
Tissue-type plasminogen activator
Ligand
BDBM50089084
Substrate
Meas. Tech.
ChEMBL_1497233 (CHEMBL3578759)
IC50
>1000000±n/a nM
Citation
 Hecker, SJReddy, KRTotrov, MHirst, GCLomovskaya, OGriffith, DCKing, PTsivkovski, RSun, DSabet, MTarazi, ZClifton, MCAtkins, KRaymond, APotts, KTAbendroth, JBoyer, SHLoutit, JSMorgan, EEDurso, SDudley, MN Discovery of a Cyclic Boronic Acidß-Lactamase Inhibitor (RPX7009) with Utility vs Class A Serine Carbapenemases. J Med Chem 58:3682-92 (2015)  
Target
Name:
Tissue-type plasminogen activator
Synonyms:
Alteplase Reteplase Thrombin receptor protein Tissue-type plasminogen activator (tPA) t-PA t-plasminogen activator
Type:
Enzyme
Mol. Mass.:
62931.08
Organism:
Homo sapiens (Human)
Description:
Residue:
562
  
Inhibitor
Name:
BDBM50089084
Synonyms:
CHEMBL3317857 | Vaborbactam
Type:
Small organic molecule
Emp. Form.:
C12H16BNO5S
Mol. Mass.:
297.135
SMILES:
OB1O[C@H](CC(O)=O)CC[C@@H]1NC(=O)Cc1cccs1
: