Target
Neutrophil elastase
Ligand
BDBM50089084
Substrate
Meas. Tech.
ChEMBL_1497236 (CHEMBL3578762)
IC50
>1000000±n/a nM
Citation
 Hecker, SJReddy, KRTotrov, MHirst, GCLomovskaya, OGriffith, DCKing, PTsivkovski, RSun, DSabet, MTarazi, ZClifton, MCAtkins, KRaymond, APotts, KTAbendroth, JBoyer, SHLoutit, JSMorgan, EEDurso, SDudley, MN Discovery of a Cyclic Boronic Acidß-Lactamase Inhibitor (RPX7009) with Utility vs Class A Serine Carbapenemases. J Med Chem 58:3682-92 (2015)  
Target
Name:
Neutrophil elastase
Synonyms:
Bone marrow serine protease Coagulation factor X ELANE Elastase HLE Leukocyte elastase Medullasin Neutrophil elastase (HNE) PMN elastase Trypsin
Type:
Enzyme
Mol. Mass.:
28532.38
Organism:
Homo sapiens (Human)
Description:
P08246
Residue:
267
  
Inhibitor
Name:
BDBM50089084
Synonyms:
CHEMBL3317857 | Vaborbactam
Type:
Small organic molecule
Emp. Form.:
C12H16BNO5S
Mol. Mass.:
297.135
SMILES:
OB1O[C@H](CC(O)=O)CC[C@@H]1NC(=O)Cc1cccs1
: