Target
Tyrosyl-DNA phosphodiesterase 1
Ligand
BDBM50090918
Substrate
Meas. Tech.
ChEMBL_1499159 (CHEMBL3585165)
IC50
37000±n/a nM
Citation
 Beck, DEAbdelmalak, MLv, WReddy, PVTender, GSO'Neill, EAgama, KMarchand, CPommier, YCushman, M Discovery of potent indenoisoquinoline topoisomerase I poisons lacking the 3-nitro toxicophore. J Med Chem 58:3997-4015 (2015)  
Target
Name:
Tyrosyl-DNA phosphodiesterase 1
Synonyms:
TDP1 Tyrosyl-DNA phosphodiesterase 1 | Tyrosyl-DNA phosphodiesterase 1 (TDP1)
Type:
Enzyme
Mol. Mass.:
68430.66
Organism:
Homo sapiens (Human)
Description:
Q9NUW8
Residue:
608
  
Inhibitor
Name:
BDBM50090918
Synonyms:
CHEMBL3581877
Type:
Small organic molecule
Emp. Form.:
C20H19N3O2
Mol. Mass.:
333.3838
SMILES:
CN(C)CCCn1c2-c3ccccc3C(=O)c2c2ccncc2c1=O
: