Target
NT-3 growth factor receptor
Ligand
BDBM50092132
Substrate
Meas. Tech.
ChEMBL_1498687 (CHEMBL3582856)
IC50
2.0±n/a nM
Citation
 Choi, HSRucker, PVWang, ZFan, YAlbaugh, PChopiuk, GGessier, FSun, FAdrian, FLiu, GHood, TLi, NJia, YChe, JMcCormack, SLi, ALi, JSteffy, ACulazzo, ATompkins, CPhung, VKreusch, ALu, MHu, BChaudhary, APrashad, MTuntland, TLiu, BHarris, JSeidel, HMLoren, JMolteni, V (R)-2-Phenylpyrrolidine Substituted Imidazopyridazines: A New Class of Potent and Selective Pan-TRK Inhibitors. ACS Med Chem Lett 6:562-7 (2015)  
Target
Name:
NT-3 growth factor receptor
Synonyms:
GP145-TrkC NTRK3_HUMAN Neurotrophic tyrosine kinase receptor type 3 Trk-C Tyrosine kinase receptor C (Trk-C)
Type:
Enzyme
Mol. Mass.:
94428.15
Organism:
Homo sapiens (Human)
Description:
Q16288
Residue:
839
  
Inhibitor
Name:
BDBM50092132
Synonyms:
CHEMBL3582440
Type:
Small organic molecule
Emp. Form.:
C26H27FN6O
Mol. Mass.:
458.5306
SMILES:
OC1CCN(CC1)c1cccc(n1)-c1cnc2ccc(nn12)N1CCC[C@@H]1c1cccc(F)c1
: