Target
Prostaglandin E2 receptor EP4 subtype
Ligand
BDBM50092617
Substrate
Meas. Tech.
ChEMBL_1501404 (CHEMBL3588433)
IC50
3500±n/a nM
Citation
 Fox, BMBeck, HPRoveto, PMKayser, FCheng, QDou, HWilliamson, TTreanor, JLiu, HJin, LXu, GMa, JWang, SOlson, SH A selective prostaglandin E2 receptor subtype 2 (EP2) antagonist increases the macrophage-mediated clearance of amyloid-beta plaques. J Med Chem 58:5256-73 (2015)  
Target
Name:
Prostaglandin E2 receptor EP4 subtype
Synonyms:
PE2R4_HUMAN PGE2 receptor EP4 subtype PTGER4 Prostanoid EP4 receptor
Type:
Enzyme
Mol. Mass.:
53134.53
Organism:
Homo sapiens (Human)
Description:
P35408
Residue:
488
  
Inhibitor
Name:
BDBM50092617
Synonyms:
CHEMBL3586309
Type:
Small organic molecule
Emp. Form.:
C24H22N2O2S
Mol. Mass.:
402.509
SMILES:
COc1cc(cc2CN(Cc3cccnc3)CCOc12)-c1csc2ccccc12
: