Target
Prostaglandin E2 receptor EP1 subtype
Ligand
BDBM50092617
Substrate
Meas. Tech.
ChEMBL_1501403 (CHEMBL3588432)
IC50
>30000±n/a nM
Citation
 Fox, BMBeck, HPRoveto, PMKayser, FCheng, QDou, HWilliamson, TTreanor, JLiu, HJin, LXu, GMa, JWang, SOlson, SH A selective prostaglandin E2 receptor subtype 2 (EP2) antagonist increases the macrophage-mediated clearance of amyloid-beta plaques. J Med Chem 58:5256-73 (2015)  
Target
Name:
Prostaglandin E2 receptor EP1 subtype
Synonyms:
PE2R1_HUMAN PTGER1 Prostaglandin E2 receptor EP1 subtype Prostanoid EP1 receptor
Type:
Enzyme
Mol. Mass.:
41834.57
Organism:
Homo sapiens (Human)
Description:
P34995
Residue:
402
  
Inhibitor
Name:
BDBM50092617
Synonyms:
CHEMBL3586309
Type:
Small organic molecule
Emp. Form.:
C24H22N2O2S
Mol. Mass.:
402.509
SMILES:
COc1cc(cc2CN(Cc3cccnc3)CCOc12)-c1csc2ccccc12
: