Target
Bromodomain-containing protein 4
Ligand
BDBM50096297
Substrate
Meas. Tech.
ChEMBL_1500427 (CHEMBL3587158)
IC50
39811±n/a nM
Citation
 Demont, EHChung, CWFurze, RCGrandi, PMichon, AMWellaway, CBarrett, NBridges, AMCraggs, PDDiallo, HDixon, DPDouault, CEmmons, AJJones, EJKaramshi, BVLocke, KMitchell, DJMouzon, BHPrinjha, RKRoberts, ADSheppard, RJWatson, RJBamborough, P Fragment-Based Discovery of Low-Micromolar ATAD2 Bromodomain Inhibitors. J Med Chem 58:5649-73 (2015)  
Target
Name:
Bromodomain-containing protein 4
Synonyms:
BRD4 Bromodomain-containing protein 4 (BRD4) Protein HUNK1
Type:
Protein
Mol. Mass.:
152264.84
Organism:
Homo sapiens (Human)
Description:
O60885
Residue:
1362
  
Inhibitor
Name:
BDBM50096297
Synonyms:
CHEMBL3586688
Type:
Small organic molecule
Emp. Form.:
C10H9NO
Mol. Mass.:
159.1846
SMILES:
Cc1cc2ccccc2[nH]c1=O
: