Target
Tyrosine-protein phosphatase non-receptor type 1
Ligand
BDBM50323212
Substrate
Meas. Tech.
ChEMBL_1501267 (CHEMBL3587976)
Ki
6800±n/a nM
Citation
 Nguyen, PHJi, DJHan, YRChoi, JSRhyu, DYMin, BSWoo, MH Selaginellin and biflavonoids as protein tyrosine phosphatase 1B inhibitors from Selaginella tamariscina and their glucose uptake stimulatory effects. Bioorg Med Chem 23:3730-7 (2015)  
Target
Name:
Tyrosine-protein phosphatase non-receptor type 1
Synonyms:
PTN1_HUMAN PTPN1 Protein tyrosine phosphatase-1B (PTP1B) Protein-tyrosine phosphatase 1B (PTP1B) Tyrosine-protein phosphatase non-receptor type 1 (PTP1B)
Type:
Protein phosphatase
Mol. Mass.:
49963.76
Organism:
Homo sapiens (Human)
Description:
Human recombinant GST-fusion PTP1B (1-435).
Residue:
435
  
Inhibitor
Name:
BDBM50323212
Synonyms:
6-[5-(5,7-Dihydroxy-4-oxo-4H-chromen-2-yl)-2-hydroxy-phenyl]-5,7-dihydroxy-2-(4-hydroxy-phenyl)-chromen-4-one ROBUSTAFLAVONE
Type:
Small organic molecule
Emp. Form.:
C30H18O10
Mol. Mass.:
538.4579
SMILES:
Oc1ccc(cc1)-c1cc(=O)c2c(O)c(c(O)cc2o1)-c1cc(ccc1O)-c1cc(O)c2c(cc(O)cc2=O)o1
: