Target
Tyrosine-protein phosphatase non-receptor type 1
Ligand
BDBM50259862
Substrate
Meas. Tech.
ChEMBL_1501267 (CHEMBL3587976)
Ki
4600±n/a nM
Citation
 Nguyen, PHJi, DJHan, YRChoi, JSRhyu, DYMin, BSWoo, MH Selaginellin and biflavonoids as protein tyrosine phosphatase 1B inhibitors from Selaginella tamariscina and their glucose uptake stimulatory effects. Bioorg Med Chem 23:3730-7 (2015)  
Target
Name:
Tyrosine-protein phosphatase non-receptor type 1
Synonyms:
PTN1_HUMAN PTPN1 Protein tyrosine phosphatase-1B (PTP1B) Protein-tyrosine phosphatase 1B (PTP1B) Tyrosine-protein phosphatase non-receptor type 1 (PTP1B)
Type:
Protein phosphatase
Mol. Mass.:
49963.76
Organism:
Homo sapiens (Human)
Description:
Human recombinant GST-fusion PTP1B (1-435).
Residue:
435
  
Inhibitor
Name:
BDBM50259862
Synonyms:
13,II8-biapigenin CHEMBL515252 cid_10414856
Type:
Small organic molecule
Emp. Form.:
C30H18O10
Mol. Mass.:
538.4579
SMILES:
Oc1ccc(cc1)-c1cc(=O)c2c(O)cc(O)c(-c3c(oc4cc(O)cc(O)c4c3=O)-c3ccc(O)cc3)c2o1
: