Target
Plasminogen
Ligand
BDBM50093552
Substrate
Meas. Tech.
ChEMBL_1501456 (CHEMBL3588562)
IC50
26000±n/a nM
Citation
 Teno, NGohda, KWanaka, KTsuda, YAkagawa, MAkiduki, EAraki, MMasuda, AOtsubo, TYamashita, Y Novel type of plasmin inhibitors: providing insight into P4 moiety and alternative scaffold to pyrrolopyrimidine. Bioorg Med Chem 23:3696-704 (2015)  
Target
Name:
Plasminogen
Synonyms:
Activation peptide PLG Plasmin Plasmin heavy chain A, short form | Plasmin light chain B
Type:
Enzyme
Mol. Mass.:
90579.18
Organism:
Homo sapiens (Human)
Description:
Residue:
810
  
Inhibitor
Name:
BDBM50093552
Synonyms:
CHEMBL3585735
Type:
Small organic molecule
Emp. Form.:
C28H31N9O5
Mol. Mass.:
573.603
SMILES:
CCCn1c2cc(ccc2oc1=O)N1CC(=O)N(Cc2cc3cnc(nc3n2C)C(=O)N[C@@H](CCCCN)C#N)C1=O
: