Target
Leucine-rich repeat serine/threonine-protein kinase 2
Ligand
BDBM50094873
Substrate
Meas. Tech.
ChEMBL_1502545 (CHEMBL3592570)
IC50
1900±n/a nM
Citation
 Lang, CARay, SSLiu, MSingh, AKCuny, GD Discovery of LRRK2 inhibitors using sequential in silico joint pharmacophore space (JPS) and ensemble docking. Bioorg Med Chem Lett 25:2713-9 (2015)  
Target
Name:
Leucine-rich repeat serine/threonine-protein kinase 2
Synonyms:
Dardarin LRRK2_HUMAN Leucine-rich repeat serine/threonine-protein kinase 2 PARK8
Type:
Protein
Mol. Mass.:
286113.20
Organism:
Homo sapiens (Human)
Description:
Q5S007
Residue:
2527
  
Inhibitor
Name:
BDBM50094873
Synonyms:
CHEMBL3588873
Type:
Small organic molecule
Emp. Form.:
C19H24N4O2
Mol. Mass.:
340.4195
SMILES:
CC(N1CCOCC1)c1ccc(NC(=O)c2cc([nH]n2)C2CC2)cc1
: