Target
Inhibin beta A chain
Ligand
BDBM50095123
Substrate
Meas. Tech.
ChEMBL_1503623 (CHEMBL3591943)
IC50
>100000±n/a nM
Citation
 Zhu, JMishra, RKSchiltz, GEMakanji, YScheidt, KAMazar, APWoodruff, TK Virtual High-Throughput Screening To Identify Novel Activin Antagonists. J Med Chem 58:5637-48 (2015)  
Target
Name:
Inhibin beta A chain
Synonyms:
Activin beta-A chain Inhba | Inhibin beta A chain
Type:
PROTEIN
Mol. Mass.:
47403.32
Organism:
Mus musculus
Description:
ChEMBL_109823
Residue:
424
  
Inhibitor
Name:
BDBM50095123
Synonyms:
CHEMBL3589513
Type:
Small organic molecule
Emp. Form.:
C20H26FN3O3
Mol. Mass.:
375.4371
SMILES:
Fc1cccc(CNC(=O)[C@@H]2CCC(=O)N(CCCN3CCCC3=O)C2)c1
: