Target
Inhibin beta A chain
Ligand
BDBM50095141
Substrate
Meas. Tech.
ChEMBL_1503623 (CHEMBL3591943)
IC50
>100000±n/a nM
Citation
 Zhu, JMishra, RKSchiltz, GEMakanji, YScheidt, KAMazar, APWoodruff, TK Virtual High-Throughput Screening To Identify Novel Activin Antagonists. J Med Chem 58:5637-48 (2015)  
Target
Name:
Inhibin beta A chain
Synonyms:
Activin beta-A chain Inhba | Inhibin beta A chain
Type:
PROTEIN
Mol. Mass.:
47403.32
Organism:
Mus musculus
Description:
ChEMBL_109823
Residue:
424
  
Inhibitor
Name:
BDBM50095141
Synonyms:
CHEMBL3589517
Type:
Small organic molecule
Emp. Form.:
C23H36N4O
Mol. Mass.:
384.5581
SMILES:
CCCn1ncc(CN2CCN(CCCc3ccccc3)[C@@H](CCO)C2)c1C
: