Target
Potassium voltage-gated channel subfamily H member 2
Ligand
BDBM50427969
Substrate
Meas. Tech.
ChEMBL_1504608 (CHEMBL3591513)
Ki
498±n/a nM
Citation
 Yu, Zvan Veldhoven, JPLouvel, J't Hart, IMRook, MBvan der Heyden, MAHeitman, LHIJzerman, AP Structure-Affinity Relationships (SARs) and Structure-Kinetics Relationships (SKRs) of Kv11.1 Blockers. J Med Chem 58:5916-29 (2015)  
Target
Name:
Potassium voltage-gated channel subfamily H member 2
Synonyms:
1,3-beta-glucan synthase component GLS2 ERG Eag-related protein 1 Ether-a-go-go-related gene (HERG) Ether-a-go-go-related gene potassium channel 1 Ether-a-go-go-related gene potassium channel 1 (hERG1) Ether-a-go-go-related protein 1 H-ERG KCNH2 Potassium voltage-gated channel subfamily H member 2 (hERG) Voltage-gated potassium channel subunit Kv11.1 hERG Potassium Channel 1 | putative potassium channel subunit
Type:
Multi-pass membrane protein
Mol. Mass.:
126672.65
Organism:
Homo sapiens (Human)
Description:
Q12809
Residue:
1159
  
Inhibitor
Name:
BDBM50427969
Synonyms:
CHEMBL2325210
Type:
Small organic molecule
Emp. Form.:
C22H16N
Mol. Mass.:
294.3686
SMILES:
C[n+]1c(cccc1C#Cc1ccccc1)C#Cc1ccccc1
: