Target
Neuronal acetylcholine receptor subunit alpha-7
Ligand
BDBM50422013
Substrate
Meas. Tech.
ChEMBL_1504717 (CHEMBL3594853)
Ki
6600±n/a nM
Citation
 Tomassoli, IGündisch, D The twin drug approach for novel nicotinic acetylcholine receptor ligands. Bioorg Med Chem 23:4375-89 (2015)  
Target
Name:
Neuronal acetylcholine receptor subunit alpha-7
Synonyms:
ACHA7_RAT Cholinergic, Nicotinic Alpha7 Chrna7 Neuronal acetylcholine receptor (alpha7 nAChR) Neuronal acetylcholine receptor subunit alpha-7 Neuronal acetylcholine receptor subunit alpha-7 (nAChR)
Type:
Enzyme
Mol. Mass.:
56502.44
Organism:
Rattus norvegicus (Rat)
Description:
Q05941
Residue:
502
  
Inhibitor
Name:
BDBM50422013
Synonyms:
LOBELINE | Lobeline Hydrochloride
Type:
Small organic molecule
Emp. Form.:
C22H27NO2
Mol. Mass.:
337.4553
SMILES:
CN1[C@@H](C[C@H](O)c2ccccc2)CCC[C@H]1CC(=O)c1ccccc1
: