Target
Trace amine-associated receptor 1
Ligand
BDBM50096964
Substrate
Meas. Tech.
ChEMBL_1499376 (CHEMBL3583705)
EC50
1700±n/a nM
Citation
 Chiellini, GNesi, GDigiacomo, MMalvasi, REspinoza, SSabatini, MFrascarelli, SLaurino, ACichero, EMacchia, MGainetdinov, RRFossa, PRaimondi, LZucchi, RRapposelli, S Design, Synthesis, and Evaluation of Thyronamine Analogues as Novel Potent Mouse Trace Amine Associated Receptor 1 (mTAAR1) Agonists. J Med Chem 58:5096-107 (2015)  
Target
Name:
Trace amine-associated receptor 1
Synonyms:
TAAR1_MOUSE Taar1 Trace amine receptor 1 (TARR1) Trace amine-associated receptor1 | Trar1
Type:
Protein
Mol. Mass.:
37635.41
Organism:
Mus musculus (Mouse)
Description:
Q923Y8
Residue:
332
  
Inhibitor
Name:
BDBM50096964
Synonyms:
CHEMBL3580901
Type:
Small organic molecule
Emp. Form.:
C15H18N2O
Mol. Mass.:
242.3162
SMILES:
NCCOc1ccc(Cc2ccc(N)cc2)cc1
: