Target
P2Y purinoceptor 14
Ligand
BDBM50194160
Substrate
Meas. Tech.
ChEMBL_1502487 (CHEMBL3592309)
EC50
1920±n/a nM
Citation
 Trujillo, KPaoletta, SKiselev, EJacobson, KA Molecular modeling of the human P2Y14 receptor: A template for structure-based design of selective agonist ligands. Bioorg Med Chem 23:4056-64 (2015)  
Target
Name:
P2Y purinoceptor 14
Synonyms:
GPR105 KIAA0001 P2Y14_HUMAN | Purinergic receptor P2Y14
Type:
PROTEIN
Mol. Mass.:
38991.62
Organism:
Homo sapiens (Human)
Description:
ChEMBL_1502487
Residue:
338
  
Inhibitor
Name:
BDBM50194160
Synonyms:
(2R,3R,4S,5R)-1-(3,4-dihydroxy-5-(diphosphoryloxymethyl)-tetrahydrofuran-2-yl)-2-thioxo-2,3-dihydropyrimidin-4(1H)-one ammonium salt | CHEMBL216011
Type:
Small organic molecule
Emp. Form.:
C9H14N2O11P2S
Mol. Mass.:
420.227
SMILES:
O[C@H]1[C@@H](O)[C@@H](O[C@@H]1COP(O)(=O)OP(O)(O)=O)n1ccc(=O)[nH]c1=S
: