Target
P2Y purinoceptor 14
Ligand
BDBM50209669
Substrate
Meas. Tech.
ChEMBL_1502487 (CHEMBL3592309)
EC50
11000±n/a nM
Citation
 Trujillo, KPaoletta, SKiselev, EJacobson, KA Molecular modeling of the human P2Y14 receptor: A template for structure-based design of selective agonist ligands. Bioorg Med Chem 23:4056-64 (2015)  
Target
Name:
P2Y purinoceptor 14
Synonyms:
GPR105 KIAA0001 P2Y14_HUMAN | Purinergic receptor P2Y14
Type:
PROTEIN
Mol. Mass.:
38991.62
Organism:
Homo sapiens (Human)
Description:
ChEMBL_1502487
Residue:
338
  
Inhibitor
Name:
BDBM50209669
Synonyms:
CHEMBL228111 diphosphoric acid 1-alpha-D-glucopyranosyl ester 2-((2'thio)uridin-5''-yl) ester
Type:
Small organic molecule
Emp. Form.:
C15H24N2O16P2S
Mol. Mass.:
582.367
SMILES:
OC[C@H]1O[C@H](OP(O)(=O)OP(O)(=O)OC[C@H]2O[C@H]([C@H](O)[C@@H]2O)n2ccc(=O)[nH]c2=S)[C@H](O)[C@@H](O)[C@@H]1O
: