Target
P2Y purinoceptor 14
Ligand
BDBM50097952
Substrate
Meas. Tech.
ChEMBL_1502487 (CHEMBL3592309)
EC50
5160000±n/a nM
Citation
 Trujillo, KPaoletta, SKiselev, EJacobson, KA Molecular modeling of the human P2Y14 receptor: A template for structure-based design of selective agonist ligands. Bioorg Med Chem 23:4056-64 (2015)  
Target
Name:
P2Y purinoceptor 14
Synonyms:
GPR105 KIAA0001 P2Y14_HUMAN | Purinergic receptor P2Y14
Type:
PROTEIN
Mol. Mass.:
38991.62
Organism:
Homo sapiens (Human)
Description:
ChEMBL_1502487
Residue:
338
  
Inhibitor
Name:
BDBM50097952
Synonyms:
CHEMBL1199733
Type:
Small organic molecule
Emp. Form.:
C15H24N2O12P2
Mol. Mass.:
486.3048
SMILES:
O[C@@H]1[C@@H](COP(O)(=O)OP(O)(=O)OC2CCCCC2)O[C@H]([C@@H]1O)n1ccc(=O)[nH]c1=O
: