Target
Histone deacetylase 3
Ligand
BDBM50322422
Substrate
Meas. Tech.
ChEMBL_1505086 (CHEMBL3596005)
IC50
9.1±n/a nM
Citation
 Clausen, DJSmith, WBHaines, BEWiest, OBradner, JEWilliams, RM Modular synthesis and biological activity of pyridyl-based analogs of the potent Class I Histone Deacetylase Inhibitor Largazole. Bioorg Med Chem 23:5061-74 (2015)  
Target
Name:
Histone deacetylase 3
Synonyms:
HD3 HDAC3_HUMAN Human HDAC3 SMAP45
Type:
Enzyme
Mol. Mass.:
48829.55
Organism:
Homo sapiens (Human)
Description:
O15379
Residue:
428
  
Inhibitor
Name:
BDBM50322422
Synonyms:
CHEMBL1173445 | Largazole
Type:
Small organic molecule
Emp. Form.:
C29H42N4O5S3
Mol. Mass.:
622.863
SMILES:
CCCCCCCC(=O)SCC\C=C\[C@@H]1CC(=O)NCc2nc(cs2)C2=N[C@@](C)(CS2)C(=O)N[C@@H](C(C)C)C(=O)O1
: