Target
Tyrosine-protein kinase JAK2
Ligand
BDBM50102661
Substrate
Meas. Tech.
ChEMBL_1443098 (CHEMBL3380804)
IC50
>30000±n/a nM
Citation
 Doig, PBoriack-Sjodin, PADumas, JHu, JItoh, KJohnson, KKazmirski, SKinoshita, TKuroda, SSato, TOSugimoto, KTohyama, KAoi, HWakamatsu, KWang, H Rational design of inhibitors of the bacterial cell wall synthetic enzyme GlmU using virtual screening and lead-hopping. Bioorg Med Chem 22:6256-69 (2014)  
Target
Name:
Tyrosine-protein kinase JAK2
Synonyms:
JAK-2 JAK2_HUMAN Janus kinase 2 (JAK2) | Janus kinase 2 (a protein tyrosine kinase)
Type:
Protein
Mol. Mass.:
130684.68
Organism:
Homo sapiens (Human)
Description:
O60674
Residue:
1132
  
Inhibitor
Name:
BDBM50102661
Synonyms:
CHEMBL3343033
Type:
Small organic molecule
Emp. Form.:
C22H18N4O3
Mol. Mass.:
386.4033
SMILES:
COc1cc2c(Nc3ccc(NC(=O)c4ccccc4)cc3)ncnc2cc1O
: