Target
Cyclin-dependent kinase 2
Ligand
BDBM50102661
Substrate
Meas. Tech.
ChEMBL_1443101 (CHEMBL3380807)
IC50
>30000±n/a nM
Citation
 Doig, PBoriack-Sjodin, PADumas, JHu, JItoh, KJohnson, KKazmirski, SKinoshita, TKuroda, SSato, TOSugimoto, KTohyama, KAoi, HWakamatsu, KWang, H Rational design of inhibitors of the bacterial cell wall synthetic enzyme GlmU using virtual screening and lead-hopping. Bioorg Med Chem 22:6256-69 (2014)  
Target
Name:
Cyclin-dependent kinase 2
Synonyms:
CDK2 CDK2_HUMAN Cell division protein kinase 2 Protein cereblon/Cyclin-dependent kinase 2 | p33 protein kinase
Type:
Enzyme Subunit
Mol. Mass.:
33938.17
Organism:
Homo sapiens (Human)
Description:
P24941
Residue:
298
  
Inhibitor
Name:
BDBM50102661
Synonyms:
CHEMBL3343033
Type:
Small organic molecule
Emp. Form.:
C22H18N4O3
Mol. Mass.:
386.4033
SMILES:
COc1cc2c(Nc3ccc(NC(=O)c4ccccc4)cc3)ncnc2cc1O
: