Target
Cyclin-dependent kinase 9
Ligand
BDBM50102661
Substrate
Meas. Tech.
ChEMBL_1443102 (CHEMBL3380808)
IC50
>30000±n/a nM
Citation
 Doig, PBoriack-Sjodin, PADumas, JHu, JItoh, KJohnson, KKazmirski, SKinoshita, TKuroda, SSato, TOSugimoto, KTohyama, KAoi, HWakamatsu, KWang, H Rational design of inhibitors of the bacterial cell wall synthetic enzyme GlmU using virtual screening and lead-hopping. Bioorg Med Chem 22:6256-69 (2014)  
Target
Name:
Cyclin-dependent kinase 9
Synonyms:
C-2K CDK9 Cell division cycle 2-like protein kinase 4 Cyclin-Dependent Kinase 9 (CDK9) Serine/threonine-protein kinase PITALRE Tat-associated kinase complex catalytic subunit
Type:
Enzyme Subunit
Mol. Mass.:
42789.13
Organism:
Homo sapiens (Human)
Description:
Residue:
372
  
Inhibitor
Name:
BDBM50102661
Synonyms:
CHEMBL3343033
Type:
Small organic molecule
Emp. Form.:
C22H18N4O3
Mol. Mass.:
386.4033
SMILES:
COc1cc2c(Nc3ccc(NC(=O)c4ccccc4)cc3)ncnc2cc1O
: