Target
Interleukin-1 receptor-associated kinase 1
Ligand
BDBM50102661
Substrate
Meas. Tech.
ChEMBL_1443096 (CHEMBL3380802)
IC50
>30000±n/a nM
Citation
 Doig, PBoriack-Sjodin, PADumas, JHu, JItoh, KJohnson, KKazmirski, SKinoshita, TKuroda, SSato, TOSugimoto, KTohyama, KAoi, HWakamatsu, KWang, H Rational design of inhibitors of the bacterial cell wall synthetic enzyme GlmU using virtual screening and lead-hopping. Bioorg Med Chem 22:6256-69 (2014)  
Target
Name:
Interleukin-1 receptor-associated kinase 1
Synonyms:
IRAK IRAK1 Interleukin-1 receptor-associated kinase 1 (IRAK-1)
Type:
Enzyme
Mol. Mass.:
76536.81
Organism:
Homo sapiens (Human)
Description:
P51617
Residue:
712
  
Inhibitor
Name:
BDBM50102661
Synonyms:
CHEMBL3343033
Type:
Small organic molecule
Emp. Form.:
C22H18N4O3
Mol. Mass.:
386.4033
SMILES:
COc1cc2c(Nc3ccc(NC(=O)c4ccccc4)cc3)ncnc2cc1O
: