Target
Albumin
Ligand
BDBM50343352
Substrate
Meas. Tech.
ChEMBL_1486769 (CHEMBL3534721)
Kd
9310±n/a nM
Citation
 Longhi, RCorbioli, SFontana, SVinco, FBraggio, SHelmdach, LSchiller, JBoriss, H Brain tissue binding of drugs: evaluation and validation of solid supported porcine brain membrane vesicles (TRANSIL) as a novel high-throughput method. Drug Metab Dispos 39:312-21 (2011)  
Target
Name:
Albumin
Synonyms:
ALBU_RAT Serum albumin
Type:
PROTEIN
Mol. Mass.:
68729.59
Organism:
Rattus norvegicus
Description:
ChEMBL_1486769
Residue:
608
  
Inhibitor
Name:
BDBM50343352
Synonyms:
2-hydroxy-3-(3-oxo-1-phenylbutyl)-4H-chromen-4-one 4-Hydroxy-3-(3-oxo-1-phenyl-butyl)-chromen-2-one CHEMBL1464 Jantoven wafarin warfarine
Type:
Small organic molecule
Emp. Form.:
C19H16O4
Mol. Mass.:
308.3279
SMILES:
CC(=O)CC(c1ccccc1)c1c(O)c2ccccc2oc1=O
: