Target
Poly [ADP-ribose] polymerase tankyrase-2
Ligand
BDBM50104285
Substrate
Meas. Tech.
ChEMBL_1505392 (CHEMBL3595275)
IC50
300±n/a nM
Citation
 Nkizinkiko, YSuneel Kumar, BVJeankumar, VUHaikarainen, TKoivunen, JMadhuri, CYogeeswari, PVenkannagari, HObaji, EPihlajaniemi, TSriram, DLehtiö, L Discovery of potent and selective nonplanar tankyrase inhibiting nicotinamide mimics. Bioorg Med Chem 23:4139-49 (2015)  
Target
Name:
Poly [ADP-ribose] polymerase tankyrase-2
Synonyms:
(ARTD6 or PARP5b) Poly [ADP-ribose] polymerase tankyrase-2 TNKL TNKS2_HUMAN Tankyrase 2 Tankyrase-2 Tankyrase-2 (TNKS2)
Type:
Enzyme
Mol. Mass.:
126937.16
Organism:
Homo sapiens (Human)
Description:
Q9H2K2
Residue:
1166
  
Inhibitor
Name:
BDBM50104285
Synonyms:
CHEMBL3593716
Type:
Small organic molecule
Emp. Form.:
C13H20N4O
Mol. Mass.:
248.3241
SMILES:
CN1CCN(CC1)c1nc2CCCCc2c(=O)[nH]1
: