Target
Interleukin-1 receptor-associated kinase 4
Ligand
BDBM50108016
Substrate
Meas. Tech.
ChEMBL_1509409 (CHEMBL3603417)
IC50
852±n/a nM
Citation
 Seganish, WMMcElroy, WTHerr, RJBrumfield, SGreenlee, WJHarding, JKomanduri, VMatasi, JPrakash, KCTulshian, DYang, JYet, LDevito, KFossetta, JGarlisi, CGLundell, DNiu, XSondey, C Initial optimization and series evolution of diaminopyrimidine inhibitors of interleukin-1 receptor associated kinase 4. Bioorg Med Chem Lett 25:3203-7 (2015)  
Target
Name:
Interleukin-1 receptor-associated kinase 4
Synonyms:
IRAK-4 IRAK4_HUMAN Interleukin-1 receptor-associated kinase 4 (IRAK4) | Renal carcinoma antigen NY-REN-64
Type:
Protein
Mol. Mass.:
51519.08
Organism:
Homo sapiens (Human)
Description:
Q9NWZ3
Residue:
460
  
Inhibitor
Name:
BDBM50108016
Synonyms:
CHEMBL3601083 | US9598440, 41
Type:
Small organic molecule
Emp. Form.:
C20H24N6O3S
Mol. Mass.:
428.508
SMILES:
Cc1cc(Nc2ncc(-c3cscn3)c(N[C@@H]3C[C@H](CO)[C@@H](O)[C@H]3O)n2)cc(C)n1
: