Target
Tumor necrosis factor ligand superfamily member 11
Ligand
BDBM50108928
Substrate
Meas. Tech.
ChEMBL_1507045 (CHEMBL3599999)
IC50
4290±n/a nM
Citation
 Lee, CCLiu, FLChen, CLChen, TCLiu, FCAhmed Ali, AAChang, DMHuang, HS Novel inhibitors of RANKL-induced osteoclastogenesis: Design, synthesis, and biological evaluation of 6-(2,4-difluorophenyl)-3-phenyl-2H-benzo[e][1,3]oxazine-2,4(3H)-diones. Bioorg Med Chem 23:4522-32 (2015)  
Target
Name:
Tumor necrosis factor ligand superfamily member 11
Synonyms:
CD_antigen=CD254 Opgl Osteoprotegerin ligand Receptor activator of nuclear factor kappa-B ligand TNF11_MOUSE Trance Tumor necrosis factor ligand superfamily member 11, soluble form
Type:
PROTEIN
Mol. Mass.:
35008.20
Organism:
Mus musculus
Description:
ChEMBL_109846
Residue:
316
  
Inhibitor
Name:
BDBM50108928
Synonyms:
CHEMBL3596954
Type:
Small organic molecule
Emp. Form.:
C21H10F5NO3
Mol. Mass.:
419.301
SMILES:
Fc1ccc(c(F)c1)-c1ccc2oc(=O)n(-c3cccc(c3)C(F)(F)F)c(=O)c2c1
: