Target
Acetylcholinesterase
Ligand
BDBM50108991
Substrate
Meas. Tech.
ChEMBL_1508181 (CHEMBL3603059)
IC50
3.5±n/a nM
Citation
 Sola, ICastellà, SViayna, EGaldeano, CTaylor, MCGbedema, SYPérez, BClos, MVJones, DCFairlamb, AHWright, CWKelly, JMMuñoz-Torrero, D Synthesis, biological profiling and mechanistic studies of 4-aminoquinoline-based heterodimeric compounds with dual trypanocidal-antiplasmodial activity. Bioorg Med Chem 23:5156-67 (2015)  
Target
Name:
Acetylcholinesterase
Synonyms:
ACES_HUMAN Acetylcholinesterase (AChE) | Acetylcholinesterase (human AChE)
Type:
Enzyme
Mol. Mass.:
67792.70
Organism:
Homo sapiens (Human)
Description:
P22303
Residue:
614
  
Inhibitor
Name:
BDBM50108991
Synonyms:
CHEMBL3600552
Type:
Small organic molecule
Emp. Form.:
C42H52Cl2N4
Mol. Mass.:
683.795
SMILES:
CC1=CC2CC(C1)c1c(C2)nc2cc(Cl)ccc2c1NCCCCCCCCCCCCNc1c2CCCCc2nc2cc(Cl)ccc12
: